{"text_format":"1","workbook":"xlsx","n_sheets":3,"sheets":["Vejledning","EBIT-margien dokumentation","Ark2"],"not_rendered":{"charts":0,"images":5,"macros":1,"external_links":0,"defined_names":0,"comments":0,"pivot_tables":0},"unopened":[],"bounds":{"document_bytes":16777216,"sheet_cells":100000,"rows_first":2000,"rows_last":500,"rows_between":2000,"halvings":0,"cell_chars":16384,"cell_head_chars":4096},"cells_cut":0,"cells_raw":0,"read":"whole","date_system":"1900"}

{"sheet":"Vejledning","index":0,"n_rows":2,"n_cols":2,"rows_kept":2,"cut":false,"hidden":false,"merged":[[1,1,1,9]]}
[]
[null,"CVR -Det Centrale Virksomhedsregister"]

{"sheet":"EBIT-margien dokumentation","index":1,"n_rows":19,"n_cols":7,"rows_kept":19,"cut":false,"hidden":false,"merged":[[1,4,1,5],[2,4,2,5],[3,4,3,5],[5,5,5,6]]}
[]
[null,"Link til CVR register.",null,null,"Omsætning.:   "]
[null,"Skema til dokumentation af EBIT-margien",null,null,"EBIT.:   "]
[null,"Gælder for regnskabsåret ..::",2022,null,"EBIT-margien.:   "]
[]
[]
[null,"Firma Navn","CVR nr.","Branchekode","Beskrivelse",{"$f":"G7-1","v":2019},{"$f":"C4-2","v":2020}]
[null,null,null,null,{"$f":"IFERROR(VLOOKUP(D8,'Ark2'!A:D,4,0),\"\")","v":""}]
[null,null,null,null,{"$f":"IFERROR(VLOOKUP(D9,'Ark2'!A:D,4,0),\"\")","v":""}]
[null,null,null,null,{"$f":"IFERROR(VLOOKUP(D10,'Ark2'!A:D,4,0),\"\")","v":""}]
[null,null,null,null,{"$f":"IFERROR(VLOOKUP(D11,'Ark2'!A:D,4,0),\"\")","v":""}]
[null,null,null,null,{"$f":"IFERROR(VLOOKUP(D12,'Ark2'!A:D,4,0),\"\")","v":""}]
[null,null,null,null,{"$f":"IFERROR(VLOOKUP(D13,'Ark2'!A:D,4,0),\"\")","v":""}]
[null,null,null,null,{"$f":"IFERROR(VLOOKUP(D14,'Ark2'!A:D,4,0),\"\")","v":""}]
[null,null,null,null,{"$f":"IFERROR(VLOOKUP(D15,'Ark2'!A:D,4,0),\"\")","v":""}]
[null,null,null,null,{"$f":"IFERROR(VLOOKUP(D16,'Ark2'!A:D,4,0),\"\")","v":""}]
[null,null,null,null,{"$f":"IFERROR(VLOOKUP(D17,'Ark2'!A:D,4,0),\"\")","v":""}]
[]
[null,null,null,null,{"$f":" \"EBIT-margin for regnskabsåret \" & C4 & \" ..:\"","v":"EBIT-margin for regnskabsåret 2022 ..:"},null,{"$f":"IFERROR(MEDIAN(F8:G17),\"\")","v":""}]

{"sheet":"Ark2","index":2,"n_rows":742,"n_cols":4,"rows_kept":742,"cut":false,"hidden":true,"merged":[]}
["NR.","Branche kode","DB07","DB07 titel"]
[11100,{"$f":"LEFT(C2,2) & LEFT(RIGHT(C2,5),2) & RIGHT(C2,2)","v":"011100"},"01.11.00","Dyrkning af korn (undtagen ris), bælgfrugter og olieholdige frø"]
[11200,"011200","01.12.00","Dyrkning af ris"]
[11300,"011300","01.13.00","Dyrkning af grøntsager og meloner, rødder og rodknolde"]
[11400,"011400","01.14.00","Dyrkning af sukkerrør"]
[11500,"011500","01.15.00","Dyrkning af tobak"]
[11600,"011600","01.16.00","Dyrkning af tekstilplanter"]
[11900,"011900","01.19.00","Dyrkning af andre etårige afgrøder"]
[12100,"012100","01.21.00","Dyrkning af druer"]
[12200,"012200","01.22.00","Dyrkning af tropiske og subtropiske frugter"]
[12300,"012300","01.23.00","Dyrkning af citrusfrugter"]
[12400,"012400","01.24.00","Dyrkning af kernefrugter og stenfrugter"]
[12500,"012500","01.25.00","Dyrkning af andre træfrugter, bær og nødder"]
[12600,"012600","01.26.00","Dyrkning af olieholdige frugter"]
[12700,"012700","01.27.00","Dyrkning af planter til fremstilling af drikkevarer"]
[12800,"012800","01.28.00","Dyrkning af krydderiplanter, aromaplanter og lægeplanter"]
[12900,"012900","01.29.00","Dyrkning af andre flerårige afgrøder"]
[13000,"013000","01.30.00","Planteformering"]
[14100,"014100","01.41.00","Avl af malkekvæg"]
[14200,"014200","01.42.00","Avl af andet kvæg og bøfler"]
[14300,"014300","01.43.00","Avl af heste og dyr af hestefamilien"]
[14400,"014400","01.44.00","Avl af kameler og dyr af kamelfamilien"]
[14500,"014500","01.45.00","Avl af får og geder"]
[14610,"014610","01.46.10","Avl af smågrise"]
[14620,"014620","01.46.20","Produktion af slagtesvin"]
[14700,"014700","01.47.00","Fjerkræavl"]
[14910,"014910","01.49.10","Kenneler"]
[14920,"014920","01.49.20","Avl af pelsdyr mv."]
[15000,"015000","01.50.00","Blandet drift"]
[16100,"016100","01.61.00","Serviceydelser i forbindelse med planteavl"]
[16200,"016200","01.62.00","Serviceydelser i forbindelse med husdyravl"]
[16300,"016300","01.63.00","Forarbejdning af afgrøder efter høst"]
[16400,"016400","01.64.00","Forarbejdning af frø/sædekorn til udsæd"]
[17000,"017000","01.70.00","Jagt, fældefangst og serviceydelser i forbindelse hermed"]
[21000,"021000","02.10.00","Dyrkning af træer og andre skovbrugsaktiviteter"]
[22000,"022000","02.20.00","Skovning"]
[23000,"023000","02.30.00","Indsamling af vildtvoksende forstmateriale undtagen træer"]
[24000,"024000","02.40.00","Serviceydelser til skovbrug"]
[31100,"031100","03.11.00","Havfiskeri"]
[31200,"031200","03.12.00","Ferskvandsfiskeri"]
[32100,"032100","03.21.00","Havbrug"]
[32200,"032200","03.22.00","Ferskvandsbrug"]
[51000,"051000","05.10.00","Indvinding af stenkul"]
[52000,"052000","05.20.00","Indvinding af brunkul"]
[61000,"061000","06.10.00","Indvinding af råolie"]
[62000,"062000","06.20.00","Indvinding af naturgas"]
[71000,"071000","07.10.00","Brydning af jernmalm"]
[72100,"072100","07.21.00","Brydning af uran- og thoriummalme"]
[72900,"072900","07.29.00","Brydning af andre ikke-jernholdige metalmalme"]
[81100,"081100","08.11.00","Brydning af pynte- og bygningssten, kalksten, gips, kridt og skifer"]
[81200,"081200","08.12.00","Grus- og sandgravning; indvinding af ler og kaolin"]
[89100,"089100","08.91.00","Indvinding af mineraler til fremstilling af kemiske produkter og gødningsstoffer"]
[89200,"089200","08.92.00","Indvinding og agglomerering af tørv"]
[89300,"089300","08.93.00","Saltindvinding"]
[89900,"089900","08.99.00","Anden råstofindvinding i.a.n."]
[91000,"091000","09.10.00","Serviceydelser i forbindelse med indvinding af råolie og naturgas"]
[99000,"099000","09.90.00","Serviceydelser i forbindelse med anden råstofindvinding"]
[101110,"101110","10.11.10","Forarbejdning af svinekød"]
[101190,"101190","10.11.90","Forarbejdning af andet kød"]
[101200,"101200","10.12.00","Forarbejdning og konservering af fjerkrækød"]
[101300,"101300","10.13.00","Produktion af kød- og fjerkrækødprodukter"]
[102010,"102010","10.20.10","Fremstilling af fiskemel"]
[102020,"102020","10.20.20","Forarbejdning og konservering af fisk, krebsdyr og bløddyr, undtagen fiskemel"]
[103100,"103100","10.31.00","Forarbejdning og konservering af kartofler"]
[103200,"103200","10.32.00","Fremstilling af frugt- og grøntsagssaft"]
[103900,{"$f":"LEFT(C66,2) & LEFT(RIGHT(C66,5),2) & RIGHT(C66,2)","v":"103900"},"10.39.00","Anden forarbejdning og konservering af frugt og grøntsager"]
[104100,"104100","10.41.00","Fremstilling af olier og fedtstoffer"]
[104200,"104200","10.42.00","Fremstilling af margarine o.l. spiselige fedtstoffer"]
[105100,"105100","10.51.00","Mejerier samt ostefremstilling"]
[105200,"105200","10.52.00","Fremstilling af konsumis"]
[106100,"106100","10.61.00","Fremstilling af mølleriprodukter"]
[106200,"106200","10.62.00","Fremstilling af stivelse og stivelsesprodukter"]
[107110,"107110","10.71.10","Industriel fremstilling af brød; kager mv."]
[107120,"107120","10.71.20","Fremstilling af friske bageriprodukter"]
[107200,"107200","10.72.00","Fremstilling af tvebakker og kiks; fremstilling af konserverede kager, tærter mv."]
[107300,"107300","10.73.00","Fremstilling af makaroni, nudler, couscous og lignende dejvarer"]
[108100,"108100","10.81.00","Fremstilling af sukker"]
[108200,"108200","10.82.00","Fremstilling af kakao, chokolade og sukkervarer"]
[108300,"108300","10.83.00","Forarbejdning af te og kaffe"]
[108400,"108400","10.84.00","Fremstilling af smagspræparater og krydderier"]
[108500,"108500","10.85.00","Fremstilling af færdigretter"]
[108600,"108600","10.86.00","Fremstilling af homogeniserede produkter og diætmad"]
[108900,"108900","10.89.00","Fremstilling af andre fødevarer i.a.n."]
[109100,"109100","10.91.00","Fremstilling af færdige foderblandinger til landbrugsdyr"]
[109200,"109200","10.92.00","Fremstilling af færdige foderblandinger til kæledyr"]
[110100,"110100","11.01.00","Destillation, rektifikation og blanding af alkohol"]
[110200,"110200","11.02.00","Fremstilling af vin af druer"]
[110300,"110300","11.03.00","Fremstilling af cider og anden frugtvin"]
[110400,"110400","11.04.00","Fremstilling af andre ikke-destillerede gærede drikkevarer"]
[110500,"110500","11.05.00","Fremstilling af øl"]
[110600,"110600","11.06.00","Fremstilling af malt"]
[110700,"110700","11.07.00","Fremstilling af læskedrikke; fremstilling af mineralvand og andet vand på flaske"]
[120000,"120000","12.00.00","Fremstilling af tobaksprodukter"]
[131000,"131000","13.10.00","Forbehandling og spinding af tekstilfibre"]
[132000,"132000","13.20.00","Vævning af tekstiler"]
[133000,"133000","13.30.00","Efterbehandling af tekstiler"]
[139100,"139100","13.91.00","Fremstilling af trikotagestoffer"]
[139210,"139210","13.92.10","Fremstilling af boligtekstiler"]
[139220,"139220","13.92.20","Fremstilling af færdige tekstilvarer undtagen boligtekstiler og beklædningsartikler"]
[139300,"139300","13.93.00","Fremstilling af tæpper"]
[139400,"139400","13.94.00","Fremstilling af reb, tovværk, sejlgarn og netstoffer"]
[139500,"139500","13.95.00","Fremstilling af fiberdug og varer af fiberdug undtagen beklædningsartikler"]
[139600,"139600","13.96.00","Fremstilling af andre tekniske og industrielle tekstiler"]
[139900,"139900","13.99.00","Fremstilling af andre tekstiler i.a.n."]
[141100,"141100","14.11.00","Fremstilling af beklædningsartikler af læder"]
[141200,"141200","14.12.00","Fremstilling af arbejdsbeklædning"]
[141300,"141300","14.13.00","Fremstilling af anden yderbeklædning"]
[141400,"141400","14.14.00","Fremstilling af underbeklædning"]
[141900,"141900","14.19.00","Fremstilling af andre beklædningsartikler samt tilbehør"]
[142000,"142000","14.20.00","Fremstilling af varer af pelsskind"]
[143100,"143100","14.31.00","Fremstilling af strikkede og hæklede strømpevarer"]
[143900,"143900","14.39.00","Fremstilling af andre strikkede og hæklede beklædningsartikler"]
[151100,"151100","15.11.00","Garvning og beredning af læder; beredning og farvning af pelsskind"]
[151200,"151200","15.12.00","Fremstilling af tasker, kufferter, sadelmagervarer mv."]
[152000,"152000","15.20.00","Fremstilling af fodtøj"]
[161000,"161000","16.10.00","Udsavning og høvling af træ"]
[162100,"162100","16.21.00","Fremstilling af finerplader og træbaserede plader"]
[162200,"162200","16.22.00","Fremstilling af sammensatte parketstave"]
[162300,"162300","16.23.00","Fremstilling af bygningstømmer og snedkeriartikler i øvrigt"]
[162400,"162400","16.24.00","Fremstilling af træemballage"]
[162900,"162900","16.29.00","Fremstilling af andre træprodukter; fremstilling af varer af kork, strå og flettematerialer"]
[171100,"171100","17.11.00","Fremstilling af papirmasse"]
[171200,"171200","17.12.00","Fremstilling af papir og pap"]
[172100,"172100","17.21.00","Fremstilling af bølgepap og pap og emballage af papir og pap"]
[172200,"172200","17.22.00","Fremstilling af husholdningsartikler og hygiejneartikler samt toiletartikler af papir og pap"]
[172300,"172300","17.23.00","Fremstilling af kontorartikler af papir"]
[172400,"172400","17.24.00","Fremstilling af tapet"]
[172900,"172900","17.29.00","Fremstilling af andre papir- og papvarer"]
[181100,"181100","18.11.00","Trykning af dagblade"]
[181200,{"$f":"LEFT(C130,2) & LEFT(RIGHT(C130,5),2) & RIGHT(C130,2)","v":"181200"},"18.12.00","Anden trykning"]
[181300,"181300","18.13.00","Prepress- og premedia-arbejde"]
[181400,"181400","18.14.00","Bogbinding og lignende serviceydelser"]
[182000,"182000","18.20.00","Reproduktion af indspillede medier"]
[191000,"191000","19.10.00","Fremstilling af koks mv."]
[192000,"192000","19.20.00","Fremstilling af raffinerede mineralolieprodukter"]
[201100,"201100","20.11.00","Fremstilling af industrigasser"]
[201200,"201200","20.12.00","Fremstilling af farvestoffer og pigmenter"]
[201300,"201300","20.13.00","Fremstilling af andre uorganiske basiskemikalier"]
[201400,"201400","20.14.00","Fremstilling af andre organiske basiskemikalier"]
[201500,"201500","20.15.00","Fremstilling af gødningsstoffer og nitrogenprodukter"]
[201600,"201600","20.16.00","Fremstilling af plast i ubearbejdet form"]
[201700,"201700","20.17.00","Fremstilling af syntetisk gummi i ubearbejdet form"]
[202000,"202000","20.20.00","Fremstilling af pesticider og andre agrokemiske produkter"]
[203000,"203000","20.30.00","Fremstilling af maling, lak og lignende overfladebehandlingsmidler, trykfarver samt tætningsmaterialer"]
[204100,"204100","20.41.00","Fremstilling af sæbe, rengørings- og rensemidler samt poleremidler"]
[204200,"204200","20.42.00","Fremstilling af parfume, hårshampoo, tandpasta mv."]
[205100,"205100","20.51.00","Fremstilling af sprængstoffer"]
[205200,"205200","20.52.00","Fremstilling af lim"]
[205300,"205300","20.53.00","Fremstilling af æteriske olier"]
[205900,"205900","20.59.00","Fremstilling af andre kemiske produkter i.a.n."]
[206000,"206000","20.60.00","Fremstilling af kemofibre"]
[211000,"211000","21.10.00","Fremstilling af farmaceutiske råvarer"]
[212000,"212000","21.20.00","Fremstilling af farmaceutiske præparater"]
[221100,"221100","22.11.00","Fremstilling af gummidæk og gummislanger; vulkanisering af dæk"]
[221900,"221900","22.19.00","Fremstilling af andre gummiprodukter"]
[222100,"222100","22.21.00","Fremstilling af plader, ark, rør og slanger samt profiler af plast"]
[222200,"222200","22.22.00","Fremstilling af plastemballage"]
[222300,"222300","22.23.00","Fremstilling af bygningsartikler af plast"]
[222900,"222900","22.29.00","Fremstilling af andre plastprodukter"]
[231100,"231100","23.11.00","Fremstilling af planglas"]
[231200,"231200","23.12.00","Formning og forarbejdning af planglas"]
[231300,"231300","23.13.00","Fremstilling af flasker, drikkeglas mv."]
[231400,"231400","23.14.00","Fremstilling af glasfiber"]
[231900,"231900","23.19.00","Fremstilling og bearbejdning af andet glas (herunder teknisk glas)"]
[232000,"232000","23.20.00","Fremstilling af ildfaste produkter"]
[233100,"233100","23.31.00","Fremstilling af keramiske teglsten og gulvfliser"]
[233200,"233200","23.32.00","Fremstilling af mursten, teglsten og byggematerialer af brændt ler"]
[234100,"234100","23.41.00","Fremstilling af keramiske husholdningsartikler og pyntegenstande"]
[234200,"234200","23.42.00","Fremstilling af keramiske sanitetsartikler"]
[234300,"234300","23.43.00","Fremstilling af keramiske isolatorer og isoleringsdele"]
[234400,"234400","23.44.00","Fremstilling af andre keramiske produkter til teknisk brug"]
[234900,"234900","23.49.00","Fremstilling af andre keramiske produkter"]
[235100,"235100","23.51.00","Fremstilling af cement"]
[235200,"235200","23.52.00","Fremstilling af kalk og gips"]
[236100,"236100","23.61.00","Fremstilling af byggematerialer af beton"]
[236200,"236200","23.62.00","Fremstilling af byggematerialer af gips"]
[236300,"236300","23.63.00","Fremstilling af færdigblandet beton"]
[236400,"236400","23.64.00","Fremstilling af mørtel"]
[236500,"236500","23.65.00","Fremstilling af fibercement"]
[236900,"236900","23.69.00","Fremstilling af andre beton-, gips- og cementprodukter"]
[237000,"237000","23.70.00","Tilhugning, tilskæring og færdigbearbejdning af sten"]
[239100,"239100","23.91.00","Fremstilling af slibemidler"]
[239910,"239910","23.99.10","Fremstilling af asfalt og tagpap"]
[239990,"239990","23.99.90","Fremstilling af andre ikke-metalholdige mineralske produkter i.a.n."]
[241000,"241000","24.10.00","Fremstilling af råjern og råstål samt jernlegeringer"]
[242000,"242000","24.20.00","Fremstilling af rør og hule profiler og tilhørende fittings af stål"]
[243100,"243100","24.31.00","Fremstilling af stænger ved koldtrækning"]
[243200,"243200","24.32.00","Fremstilling af stålbånd ved koldvalsning"]
[243300,"243300","24.33.00","Koldbehandling"]
[243400,"243400","24.34.00","Fremstilling af tråd ved koldtrækning"]
[244100,"244100","24.41.00","Fremstilling af ædelmetaller"]
[244200,"244200","24.42.00","Fremstilling af aluminium"]
[244300,"244300","24.43.00","Fremstilling af bly, zink og tin"]
[244400,{"$f":"LEFT(C194,2) & LEFT(RIGHT(C194,5),2) & RIGHT(C194,2)","v":"244400"},"24.44.00","Fremstilling af kobber"]
[244500,"244500","24.45.00","Anden fremstilling af ikke-jernholdige metaller"]
[244600,"244600","24.46.00","Oparbejdning af nukleart brændsel"]
[245100,"245100","24.51.00","Støbning af jernprodukter"]
[245200,"245200","24.52.00","Støbning af stålprodukter"]
[245300,"245300","24.53.00","Støbning af letmetalprodukter"]
[245400,"245400","24.54.00","Støbning af andre ikke-jernholdige metalprodukter"]
{"$rows_left_out":542}